Target
Tyrosine-protein kinase BTK
Ligand
BDBM326208
Substrate
Meas. Tech.
LANCE (Lanthanide Chelate Excite) TR-FRET (Time-resolved fluorescence resonance energy transfer) assay
IC50
9.20±n/a nM
Citation
 Liu, JKim, RMKozlowski, JKrikorian, ADAnand, R Btk inhibitors US Patent  US9637486 Publication Date 5/2/2017 
Target
Name:
Tyrosine-protein kinase BTK
Synonyms:
AGMX1 Agammaglobulinaemia tyrosine kinase B cell progenitor kinase BPK BTK_HUMAN Tyrosine Kinase BTK Tyrosine-protein kinase BTK (BTK)
Type:
Enzyme
Mol. Mass.:
76289.95
Organism:
Homo sapiens (Human)
Description:
Q06187
Residue:
659
  
Inhibitor
Name:
BDBM326208
Synonyms:
3-{(3R)-1-[(1,4-dimethyl- 1H-imidazol-5- yl)carbonyl]piperidin-3- yl}-1-(4-phenoxyphenyl)- 1H-pyrazolo[3,4- c]pyridin-7-amine | US9637486, Example 20
Type:
Small organic molecule
Emp. Form.:
C29H29N7O2
Mol. Mass.:
507.5863
SMILES:
Cc1ncn(C)c1C(=O)N1CCC[C@H](C1)c1nn(-c2ccc(Oc3ccccc3)cc2)c2c(N)nccc12
: