Target
Tyrosine-protein kinase BTK
Ligand
BDBM326212
Substrate
Meas. Tech.
LANCE (Lanthanide Chelate Excite) TR-FRET (Time-resolved fluorescence resonance energy transfer) assay
IC50
1.000±n/a nM
Citation
 Liu, JKim, RMKozlowski, JKrikorian, ADAnand, R Btk inhibitors US Patent  US9637486 Publication Date 5/2/2017 
Target
Name:
Tyrosine-protein kinase BTK
Synonyms:
AGMX1 Agammaglobulinaemia tyrosine kinase B cell progenitor kinase BPK BTK_HUMAN Tyrosine Kinase BTK Tyrosine-protein kinase BTK (BTK)
Type:
Enzyme
Mol. Mass.:
76289.95
Organism:
Homo sapiens (Human)
Description:
Q06187
Residue:
659
  
Inhibitor
Name:
BDBM326212
Synonyms:
3-[(3R)-1-but-2- ynoylpiperidin-3-yl]-1-(4- phenoxyphenyl)-1H- pyrazolo[3,4-c]pyridin-7- amine | US9637486, Example 24
Type:
Small organic molecule
Emp. Form.:
C27H25N5O2
Mol. Mass.:
451.5197
SMILES:
CC#CC(=O)N1CCC[C@H](C1)c1nn(-c2ccc(Oc3ccccc3)cc2)c2c(N)nccc12
: