Target
Tyrosine-protein kinase BTK
Ligand
BDBM326216
Substrate
Meas. Tech.
LANCE (Lanthanide Chelate Excite) TR-FRET (Time-resolved fluorescence resonance energy transfer) assay
IC50
5.80±n/a nM
Citation
 Liu, JKim, RMKozlowski, JKrikorian, ADAnand, R Btk inhibitors US Patent  US9637486 Publication Date 5/2/2017 
Target
Name:
Tyrosine-protein kinase BTK
Synonyms:
AGMX1 Agammaglobulinaemia tyrosine kinase B cell progenitor kinase BPK BTK_HUMAN Tyrosine Kinase BTK Tyrosine-protein kinase BTK (BTK)
Type:
Enzyme
Mol. Mass.:
76289.95
Organism:
Homo sapiens (Human)
Description:
Q06187
Residue:
659
  
Inhibitor
Name:
BDBM326216
Synonyms:
(2R)-1-[(2S,5R)-5-{7-amino-1-[4-(3-fluorophenoxy)phenyl]-1H-pyrazolo[3,4-c]pyridin-3-yl}-2-methylpiperidin-1-yl]-1-oxopropan-2-ol | US9637486, Example 29
Type:
Small organic molecule
Emp. Form.:
C27H28FN5O3
Mol. Mass.:
489.5413
SMILES:
C[C@@H](O)C(=O)N1C[C@@H](CC[C@@H]1C)c1nn(-c2ccc(Oc3cccc(F)c3)cc2)c2c(N)nccc12
: