Target
cAMP-specific 3',5'-cyclic phosphodiesterase 4A
Ligand
BDBM47184
Substrate
Meas. Tech.
PDE4 Assay
IC50
2.00±n/a nM
Citation
 Nielsen, SF Benzodioxole or benzodioxepine heterocyclic compounds as phosphodiesterase inhibitors US Patent  US9637499 Publication Date 5/2/2017 
Target
Name:
cAMP-specific 3',5'-cyclic phosphodiesterase 4A
Synonyms:
3',5'-cyclic phosphodiesterase PDE46 PDE4A_HUMAN Phosphodiesterase 4A | Phosphodiesterase 4A (PDE4)
Type:
Enzyme
Mol. Mass.:
98113.27
Organism:
Homo sapiens (Human)
Description:
P27815
Residue:
886
  
Inhibitor
Name:
BDBM47184
Synonyms:
US8980905, 110 | US9637499, Compound 110
Type:
Emp. Form.:
C18H14Cl2F2N2O4S
Mol. Mass.:
463.283
SMILES:
FC(F)Oc1ccc(C(=O)Nc2c(Cl)cncc2Cl)c2OC3(CCSCC3)Oc12
: