Target
cAMP-specific 3',5'-cyclic phosphodiesterase 4A
Ligand
BDBM47185
Substrate
Meas. Tech.
PDE4 Assay
IC50
106±n/a nM
Citation
 Nielsen, SF Benzodioxole or benzodioxepine heterocyclic compounds as phosphodiesterase inhibitors US Patent  US9637499 Publication Date 5/2/2017 
Target
Name:
cAMP-specific 3',5'-cyclic phosphodiesterase 4A
Synonyms:
3',5'-cyclic phosphodiesterase PDE46 PDE4A_HUMAN Phosphodiesterase 4A | Phosphodiesterase 4A (PDE4)
Type:
Enzyme
Mol. Mass.:
98113.27
Organism:
Homo sapiens (Human)
Description:
P27815
Residue:
886
  
Inhibitor
Name:
BDBM47185
Synonyms:
US8980905, 111 | US9637499, Compound 111
Type:
Emp. Form.:
C18H14Cl2F2N2O7S
Mol. Mass.:
511.281
SMILES:
[O-][n+]1cc(Cl)c(NC(=O)c2ccc(OC(F)F)c3OC4(CCS(=O)(=O)CC4)Oc23)c(Cl)c1
: