Target
Isocitrate dehydrogenase [NADP] cytoplasmic [R132H]
Ligand
BDBM326539
Substrate
Meas. Tech.
Inhibition Assay
IC50
<500±n/a nM
Citation
 Cao, SPopovici-Muller, JSalituro, FGSaunders, JOTan, XTravins, JYan, SYe, Z Phenyl and pyridinyl substituted piperidines and piperazines as inhibitors of IDH1 mutants and their use in treating cancer US Patent  US9662327 Publication Date 5/30/2017 
Target
Name:
Isocitrate dehydrogenase [NADP] cytoplasmic [R132H]
Synonyms:
Cytosolic NADP-isocitrate dehydrogenase (IDH1)(R132H) IDH1 R132H IDHC_HUMAN Isocitrate dehydrogenase 1 mutant (R132H) Isocitrate dehydrogenase [NADP] cytoplasmic (IDH1)(R132H) PICD
Type:
Protein
Mol. Mass.:
46641.74
Organism:
Homo sapiens (Human)
Description:
Human IDH1 R132H (SEQ ID No. 2 in patent). First three are removed. Google patent parsed wrong.
Residue:
414
  
Inhibitor
Name:
BDBM326539
Synonyms:
US9662327, Compound 236
Type:
Small organic molecule
Emp. Form.:
C26H32N4O2S
Mol. Mass.:
464.623
SMILES:
CC[C@@H]1CN(CCN1C(=O)Cc1cccs1)c1nc(C2CC2)c2COC(C)(C)Cc2c1C#N
: