Target
Leukotriene A-4 hydrolase
Ligand
BDBM327013
Substrate
Meas. Tech.
Enzyme Assay
IC50
0.150±n/a nM
Citation
 Bylock, LA Benzodioxane inhibitors of leukotriene production for combination therapy US Patent  US9662339 Publication Date 5/30/2017 
Target
Name:
Leukotriene A-4 hydrolase
Synonyms:
LKHA4_HUMAN LTA4 Leukotriene A(4) hydrolase Leukotriene A4 hydrolase
Type:
Hydrolase; metalloprotease
Mol. Mass.:
69280.41
Organism:
Homo sapiens (Human)
Description:
Human recombinant LTA4H.
Residue:
611
  
Inhibitor
Name:
BDBM327013
Synonyms:
(3S)-3-[4-(morpholin-4- ylmethyl)phenyl]-2,3- dihydro[1,4]dioxino[2,3- b]pyridine | US9662339, 204
Type:
Small organic molecule
Emp. Form.:
C18H20N2O3
Mol. Mass.:
312.363
SMILES:
C(N1CCOCC1)c1ccc(cc1)[C@H]1COc2cccnc2O1
: