Target
Leukotriene A-4 hydrolase
Ligand
BDBM327093
Substrate
Meas. Tech.
Enzyme Assay
IC50
0.130±n/a nM
Citation
 Bylock, LA Benzodioxane inhibitors of leukotriene production for combination therapy US Patent  US9662339 Publication Date 5/30/2017 
Target
Name:
Leukotriene A-4 hydrolase
Synonyms:
LKHA4_HUMAN LTA4 Leukotriene A(4) hydrolase Leukotriene A4 hydrolase
Type:
Hydrolase; metalloprotease
Mol. Mass.:
69280.41
Organism:
Homo sapiens (Human)
Description:
Human recombinant LTA4H.
Residue:
611
  
Inhibitor
Name:
BDBM327093
Synonyms:
1-{4-[(2S)-2,3-dihydro-1,4- benzodioxin-2-yl]benzyl}-4-(1,1- dioxido-1,2-thiazolidin-2- yl)piperidine | US9662339, 224
Type:
Small organic molecule
Emp. Form.:
C23H28N2O4S
Mol. Mass.:
428.544
SMILES:
O=S1(=O)CCCN1C1CCN(Cc2ccc(cc2)[C@H]2COc3ccccc3O2)CC1
: