Target
Leukotriene A-4 hydrolase
Ligand
BDBM327181
Substrate
Meas. Tech.
Enzyme Assay
IC50
0.090±n/a nM
Citation
 Bylock, LA Benzodioxane inhibitors of leukotriene production for combination therapy US Patent  US9662339 Publication Date 5/30/2017 
Target
Name:
Leukotriene A-4 hydrolase
Synonyms:
LKHA4_HUMAN LTA4 Leukotriene A(4) hydrolase Leukotriene A4 hydrolase
Type:
Hydrolase; metalloprotease
Mol. Mass.:
69280.41
Organism:
Homo sapiens (Human)
Description:
Human recombinant LTA4H.
Residue:
611
  
Inhibitor
Name:
BDBM327181
Synonyms:
1-{(1S,4S)-5-[(S)-4-(2,3-Dihydro- [1,4]dioxino[2,3-b]pyridin-3-yl)- benzyl]-2,5-diaza- bicyclo[2.2.2]oct-2-yl}-ethanone | US9662339, 264
Type:
Small organic molecule
Emp. Form.:
C22H25N3O3
Mol. Mass.:
379.4522
SMILES:
CC(=O)N1C[C@@H]2CC[C@H]1CN2Cc1ccc(cc1)[C@H]1COc2cccnc2O1
: