Target
Leukotriene A-4 hydrolase
Ligand
BDBM327187
Substrate
Meas. Tech.
Enzyme Assay
IC50
0.140±n/a nM
Citation
 Bylock, LA Benzodioxane inhibitors of leukotriene production for combination therapy US Patent  US9662339 Publication Date 5/30/2017 
Target
Name:
Leukotriene A-4 hydrolase
Synonyms:
LKHA4_HUMAN LTA4 Leukotriene A(4) hydrolase Leukotriene A4 hydrolase
Type:
Hydrolase; metalloprotease
Mol. Mass.:
69280.41
Organism:
Homo sapiens (Human)
Description:
Human recombinant LTA4H.
Residue:
611
  
Inhibitor
Name:
BDBM327187
Synonyms:
1-{5-[(S)-4-(2,3-Dihydro- [1,4]dioxino[2,3-b]pyridin-3-yl)- benzyl]-hexahydro-pyrrolo[3,4- c]pyrrol-2-yl}-ethanone | US9662339, 270
Type:
Small organic molecule
Emp. Form.:
C22H25N3O3
Mol. Mass.:
379.4522
SMILES:
CC(=O)N1CC2CN(Cc3ccc(cc3)[C@H]3COc4cccnc4O3)CC2C1
: