Target
Lysine-specific histone demethylase 1A
Ligand
BDBM194243
Substrate
Meas. Tech.
LSD1 Histone Demethylase Biochemical Assay
pH
7.5±n/a
IC50
<100±n/a nM
Comments
extracted
Citation
 Wu, LHe, CYao, WZhang, F Cyclopropylamines as LSD1 inhibitors US Patent  US9670210 Publication Date 6/6/2017 
Target
Name:
Lysine-specific histone demethylase 1A
Synonyms:
AOF2 Flavin-containing amine oxidase domain-containing protein 2 KDM1A KIAA0601 Lysine-specific demethylase 1 (LSD1) Lysine-specific histone demethylase 1 (LSD1)
Type:
Enzyme
Mol. Mass.:
92901.01
Organism:
Homo sapiens (Human)
Description:
O60341
Residue:
852
  
Inhibitor
Name:
BDBM194243
Synonyms:
US10174030, Example 43 US11247992, Example 43 | US9670210, Example 43 (1R,2S)¿N-({4-(methoxymethyl)-1-[(4-methylpiperazin-1-yl)carbonyl]piperidin-4-yl}methyl)-2-phenylcyclopropanamine
Type:
Small organic molecule
Emp. Form.:
C23H36N4O2
Mol. Mass.:
400.5575
SMILES:
COCC1(CN[C@@H]2CC2c2ccccc2)CCN(CC1)C(=O)N1CCN(C)CC1
: