Target
Metabotropic glutamate receptor 2
Ligand
BDBM212868
Substrate
Meas. Tech.
Biological Assay
IC50
64.0±n/a nM
Citation
 Bungard, CJConverso, ADe Leon, PHanney, BHartingh, TJManikowski, JJManley, PJMeissner, RMeng, ZPerkins, JJRudd, MTShu, Y Quinoline carboxamide and quinoline carbonitrile derivatives as mGluR2-negative allosteric modulators, compositions, and their use US Patent  US9663506 Publication Date 5/30/2017 
Target
Name:
Metabotropic glutamate receptor 2
Synonyms:
GPRC1B GRM2_HUMAN Metabotropic glutamate receptor mGlu2 | metabotropic glutamate 2
Type:
Enzyme
Mol. Mass.:
95584.88
Organism:
Homo sapiens (Human)
Description:
Q14416
Residue:
872
  
Inhibitor
Name:
BDBM212868
Synonyms:
US9278960, 2-15 | US9663506, Example 2-15
Type:
Small organic molecule
Emp. Form.:
C23H21FN4O3
Mol. Mass.:
420.4362
SMILES:
CN1C(=O)N(Cc2ccc3c(cc(nc3c2)C(N)=O)-c2ccc(F)cc2)C(=O)C1(C)C
: