Target
Sodium channel protein type 9 subunit alpha
Ligand
BDBM329039
Substrate
Meas. Tech.
Nav 1.7 In Vitro Patch Express (PX) Assay
IC50
31.3±n/a nM
Citation
 Bregman, HChakka, NDimauro, EFGao, HGunaydin, HHuang, HOlivieri, PRSchenkel, LWeiss, M Biaryl acyl-sulfonamide compounds as sodium channel inhibitors US Patent  US9663508 Publication Date 5/30/2017 
Target
Name:
Sodium channel protein type 9 subunit alpha
Synonyms:
NENA Peripheral sodium channel 1 SCN9A_HUMAN Voltage-gated sodium channel subunit Nav1.7 hNE-Na
Type:
Protein
Mol. Mass.:
226375.97
Organism:
Homo sapiens (Human)
Description:
Q15858
Residue:
1988
  
Inhibitor
Name:
BDBM329039
Synonyms:
4-(5-chloro-6-(3,5- dichlorophenoxy)-3-pyridinyl)- N-(methylsulfonyl)-3-(3- oxetanyloxy)benzamide US9663508, Example 422
Type:
Small organic molecule
Emp. Form.:
C22H17Cl3N2O6S
Mol. Mass.:
543.804
SMILES:
CS(=O)(=O)NC(=O)c1ccc(c(OC2COC2)c1)-c1cnc(Oc2cc(Cl)cc(Cl)c2)c(Cl)c1
: