Target
Sodium channel protein type 9 subunit alpha
Ligand
BDBM329078
Substrate
Meas. Tech.
Nav 1.7 In Vitro Patch Express (PX) Assay
IC50
48.6±n/a nM
Citation
 Bregman, HChakka, NDimauro, EFGao, HGunaydin, HHuang, HOlivieri, PRSchenkel, LWeiss, M Biaryl acyl-sulfonamide compounds as sodium channel inhibitors US Patent  US9663508 Publication Date 5/30/2017 
Target
Name:
Sodium channel protein type 9 subunit alpha
Synonyms:
NENA Peripheral sodium channel 1 SCN9A_HUMAN Voltage-gated sodium channel subunit Nav1.7 hNE-Na
Type:
Protein
Mol. Mass.:
226375.97
Organism:
Homo sapiens (Human)
Description:
Q15858
Residue:
1988
  
Inhibitor
Name:
BDBM329078
Synonyms:
4-(5-chloro-6-(3-chloro-2-methylphenoxy)-3-pyridinyl)-3-methoxy-N-(methylsulfonyl)benzamide | US9663508, Example 579
Type:
Small organic molecule
Emp. Form.:
C21H18Cl2N2O5S
Mol. Mass.:
481.349
SMILES:
COc1cc(ccc1-c1cnc(Oc2cccc(Cl)c2C)c(Cl)c1)C(=O)NS(C)(=O)=O
: