Target
Sodium channel protein type 9 subunit alpha
Ligand
BDBM329088
Substrate
Meas. Tech.
Nav 1.7 In Vitro Patch Express (PX) Assay
IC50
49.9±n/a nM
Citation
 Bregman, HChakka, NDimauro, EFGao, HGunaydin, HHuang, HOlivieri, PRSchenkel, LWeiss, M Biaryl acyl-sulfonamide compounds as sodium channel inhibitors US Patent  US9663508 Publication Date 5/30/2017 
Target
Name:
Sodium channel protein type 9 subunit alpha
Synonyms:
NENA Peripheral sodium channel 1 SCN9A_HUMAN Voltage-gated sodium channel subunit Nav1.7 hNE-Na
Type:
Protein
Mol. Mass.:
226375.97
Organism:
Homo sapiens (Human)
Description:
Q15858
Residue:
1988
  
Inhibitor
Name:
BDBM329088
Synonyms:
5-chloro-4-(5-chloro-6-(2,3,5-trifluorophenoxy)-3-pyridinyl)- US9663508, Example 589
Type:
Small organic molecule
Emp. Form.:
C19H10Cl2F4N2O4S
Mol. Mass.:
509.258
SMILES:
CS(=O)(=O)NC(=O)c1cc(Cl)c(cc1F)-c1cnc(Oc2cc(F)cc(F)c2F)c(Cl)c1
: