Target
Sodium channel protein type 9 subunit alpha
Ligand
BDBM329164
Substrate
Meas. Tech.
Nav 1.7 In Vitro Patch Express (PX) Assay
IC50
49.7±n/a nM
Citation
 Bregman, HChakka, NDimauro, EFGao, HGunaydin, HHuang, HOlivieri, PRSchenkel, LWeiss, M Biaryl acyl-sulfonamide compounds as sodium channel inhibitors US Patent  US9663508 Publication Date 5/30/2017 
Target
Name:
Sodium channel protein type 9 subunit alpha
Synonyms:
NENA Peripheral sodium channel 1 SCN9A_HUMAN Voltage-gated sodium channel subunit Nav1.7 hNE-Na
Type:
Protein
Mol. Mass.:
226375.97
Organism:
Homo sapiens (Human)
Description:
Q15858
Residue:
1988
  
Inhibitor
Name:
BDBM329164
Synonyms:
4-(5-chloro-6-(2-chloro-4,6- difluorophenoxy)-3-pyridinyl)- 2-fluoro-5-methyl-N- (methylsulfonyl)benzamide US9663508, Example 666
Type:
Small organic molecule
Emp. Form.:
C20H13Cl2F3N2O4S
Mol. Mass.:
505.294
SMILES:
Cc1cc(C(=O)NS(C)(=O)=O)c(F)cc1-c1cnc(Oc2c(F)cc(F)cc2Cl)c(Cl)c1
: