Target
Sodium channel protein type 9 subunit alpha
Ligand
BDBM329192
Substrate
Meas. Tech.
Nav 1.7 In Vitro Patch Express (PX) Assay
IC50
17.2±n/a nM
Citation
 Bregman, HChakka, NDimauro, EFGao, HGunaydin, HHuang, HOlivieri, PRSchenkel, LWeiss, M Biaryl acyl-sulfonamide compounds as sodium channel inhibitors US Patent  US9663508 Publication Date 5/30/2017 
Target
Name:
Sodium channel protein type 9 subunit alpha
Synonyms:
NENA Peripheral sodium channel 1 SCN9A_HUMAN Voltage-gated sodium channel subunit Nav1.7 hNE-Na
Type:
Protein
Mol. Mass.:
226375.97
Organism:
Homo sapiens (Human)
Description:
Q15858
Residue:
1988
  
Inhibitor
Name:
BDBM329192
Synonyms:
4-(5-cyano-6-(3,6-dichloro-2-methylphenoxy)-3-pyridinyl)-3-methoxy-N-(methylsulfonyl)benzamide | US9663508, Example 694
Type:
Small organic molecule
Emp. Form.:
C22H17Cl2N3O5S
Mol. Mass.:
506.358
SMILES:
COc1cc(ccc1-c1cnc(Oc2c(Cl)ccc(Cl)c2C)c(c1)C#N)C(=O)NS(C)(=O)=O
: