Target
Rho-associated protein kinase 2
Ligand
BDBM330154
Substrate
Meas. Tech.
In Vitro Assay
IC50
46.3±n/a nM
Citation
 Quan, MLHu, ZWang, C Tricyclic pyrido-carboxamide derivatives as rock inhibitors US Patent  US9663529 Publication Date 5/30/2017 
Target
Name:
Rho-associated protein kinase 2
Synonyms:
KIAA0619 ROCK2 Rho kinase 2 (ROCKII) Rho-associated protein kinase 2 (ROCK2) Rho-associated protein kinase 2/Transforming protein RhoA Rho-associated, coiled-coil-containing protein kinase II p164 ROCK-2
Type:
Protein
Mol. Mass.:
160885.43
Organism:
Homo sapiens (Human)
Description:
O75116
Residue:
1388
  
Inhibitor
Name:
BDBM330154
Synonyms:
2-(3-Chlorophenyl)-N-(9H-pyrido[3,4-b]indol-7-yl)acetamide | US9663529, Example IV-2
Type:
Small organic molecule
Emp. Form.:
C19H14ClN3O
Mol. Mass.:
335.787
SMILES:
Clc1cccc(CC(=O)Nc2ccc3c(c2)[nH]c2cnccc32)c1
: