Target
Sigma intracellular receptor 2
Ligand
BDBM312154
Substrate
Meas. Tech.
Receptor Assay
Ki
2.56±1.22 nM
Citation
 McCurdy, CRMesangeau, CChin, FTJames, MLShen, BGambhir, SBiswal, SBehera, D Highly selective sigma receptor ligands and radioligands as probes in nociceptive processing and the pathphysiological study of memory deficits and cognitive disorders US Patent  US9724435 Publication Date 8/8/2017 
Target
Name:
Sigma intracellular receptor 2
Synonyms:
S2r Sigma intracellular receptor 2 Sigma2 receptor Transmembrane protein 97
Type:
Protein
Mol. Mass.:
20953.88
Organism:
Rattus norvegicus (Rat)
Description:
Q5U3Y7
Residue:
176
  
Inhibitor
Name:
BDBM312154
Synonyms:
US9604926, Compound CM-146 | US9724435, Compound CM-146
Type:
Small organic molecule
Emp. Form.:
C23H35N3O2
Mol. Mass.:
385.5429
SMILES:
CCc1ccc2n(CCCCN3CCN(CC3)C3CCCCC3)c(=O)oc2c1
: