Target
Sigma intracellular receptor 2
Ligand
BDBM50374598
Substrate
Meas. Tech.
Receptor Assay
Ki
0.550±0.08 nM
Citation
 McCurdy, CRMesangeau, CChin, FTJames, MLShen, BGambhir, SBiswal, SBehera, D Highly selective sigma receptor ligands and radioligands as probes in nociceptive processing and the pathphysiological study of memory deficits and cognitive disorders US Patent  US9724435 Publication Date 8/8/2017 
Target
Name:
Sigma intracellular receptor 2
Synonyms:
S2r Sigma intracellular receptor 2 Sigma2 receptor Transmembrane protein 97
Type:
Protein
Mol. Mass.:
20953.88
Organism:
Rattus norvegicus (Rat)
Description:
Q5U3Y7
Residue:
176
  
Inhibitor
Name:
BDBM50374598
Synonyms:
CHEMBL272603 US9724435, Compound CM-156
Type:
Small organic molecule
Emp. Form.:
C21H31N3S2
Mol. Mass.:
389.621
SMILES:
S=c1sc2ccccc2n1CCCCN1CCN(CC1)C1CCCCC1
: