Target
Sigma intracellular receptor 2
Ligand
BDBM312166
Substrate
Meas. Tech.
Receptor Assay
Ki
0.700±0.11 nM
Citation
 McCurdy, CRMesangeau, CChin, FTJames, MLShen, BGambhir, SBiswal, SBehera, D Highly selective sigma receptor ligands and radioligands as probes in nociceptive processing and the pathphysiological study of memory deficits and cognitive disorders US Patent  US9724435 Publication Date 8/8/2017 
Target
Name:
Sigma intracellular receptor 2
Synonyms:
S2r Sigma intracellular receptor 2 Sigma2 receptor Transmembrane protein 97
Type:
Protein
Mol. Mass.:
20953.88
Organism:
Rattus norvegicus (Rat)
Description:
Q5U3Y7
Residue:
176
  
Inhibitor
Name:
BDBM312166
Synonyms:
US9604926, Compound CM-170 | US9724435, Compound CM-170
Type:
Small organic molecule
Emp. Form.:
C21H24FN3O2
Mol. Mass.:
369.4326
SMILES:
Fc1ccc(cc1)N1CCN(CCCCn2c3ccccc3oc2=O)CC1
: