Target
Sigma non-opioid intracellular receptor 1
Ligand
BDBM312227
Substrate
Meas. Tech.
Receptor Assay
Ki
2.15±0.25 nM
Citation
 McCurdy, CRMesangeau, CChin, FTJames, MLShen, BGambhir, SBiswal, SBehera, D Highly selective sigma receptor ligands and radioligands as probes in nociceptive processing and the pathphysiological study of memory deficits and cognitive disorders US Patent  US9724435 Publication Date 8/8/2017 
Target
Name:
Sigma non-opioid intracellular receptor 1
Synonyms:
Opioid receptor SGMR1_RAT Sigma non-opioid intracellular receptor 1 Sigma-1 | Sigmar1
Type:
Enzyme Catalytic Domain
Mol. Mass.:
25266.54
Organism:
RAT
Description:
Q9R0C9
Residue:
223
  
Inhibitor
Name:
BDBM312227
Synonyms:
US9604926, Compound SC-6 | US9724435, Compound SC-6
Type:
Small organic molecule
Emp. Form.:
C22H33N3OS
Mol. Mass.:
387.582
SMILES:
CCCc1ccc2n(CCN3CCN(CC3)C3CCCCC3)c(=O)sc2c1
: