Target
Cannabinoid receptor 1
Ligand
BDBM163048
Substrate
Meas. Tech.
Radioligand Binding Assay
Temperature
298.15±n/a K
IC50
3981±n/a nM
Comments
extracted
Citation
 Chen, JPettit, SFliri, H Cannabinoid-2 agonists US Patent  US9670216 Publication Date 6/6/2017 
Target
Name:
Cannabinoid receptor 1
Synonyms:
CANN6 CB-R CNR CNR1_HUMAN Cannabinoid receptor Cannabinoid receptor 1 (brain)
Type:
G Protein-Coupled Receptor (GPCR)
Mol. Mass.:
52868.96
Organism:
Homo sapiens (Human)
Description:
P21554
Residue:
472
  
Inhibitor
Name:
BDBM163048
Synonyms:
US9062004, 11 | US9670216, 11 4-Chloro-5-(2-morpholin-4-ylethylamino)-2-(3,3,5,5-tetramethylcyclohexyl)pyridazin-3-one
Type:
Small organic molecule
Emp. Form.:
C20H33ClN4O2
Mol. Mass.:
396.955
SMILES:
CC1(C)CC(CC(C)(C)C1)n1ncc(NCCN2CCOCC2)c(Cl)c1=O
: