Target
Cannabinoid receptor 2
Ligand
BDBM163061
Substrate
Meas. Tech.
Radioligand Binding Assay
Temperature
298.15±n/a K
IC50
>10000±n/a nM
Comments
extracted
Citation
 Chen, JPettit, SFliri, H Cannabinoid-2 agonists US Patent  US9670216 Publication Date 6/6/2017 
Target
Name:
Cannabinoid receptor 2
Synonyms:
CANNABINOID CB2 CB2 CB2B CNR2_HUMAN Cannabinoid CB2 receptor Cannabinoid receptor 2 (CB2R) | hCB2
Type:
G Protein-Coupled Receptor (GPCR)
Mol. Mass.:
39690.94
Organism:
Homo sapiens (Human)
Description:
P34972
Residue:
360
  
Inhibitor
Name:
BDBM163061
Synonyms:
US9062004, 27 | US9670216, 27 2-t-Butyl-4-chloro-5-(2-morpholin-4-ylethylamino)-pyridazin-3-one
Type:
Small organic molecule
Emp. Form.:
C14H23ClN4O2
Mol. Mass.:
314.811
SMILES:
CC(C)(C)n1ncc(NCCN2CCOCC2)c(Cl)c1=O
: