Target
Cannabinoid receptor 1
Ligand
BDBM163068
Substrate
Meas. Tech.
Radioligand Binding Assay
Temperature
298.15±n/a K
IC50
>10000±n/a nM
Comments
extracted
Citation
 Chen, JPettit, SFliri, H Cannabinoid-2 agonists US Patent  US9670216 Publication Date 6/6/2017 
Target
Name:
Cannabinoid receptor 1
Synonyms:
CANN6 CB-R CNR CNR1_HUMAN Cannabinoid receptor Cannabinoid receptor 1 (brain)
Type:
G Protein-Coupled Receptor (GPCR)
Mol. Mass.:
52868.96
Organism:
Homo sapiens (Human)
Description:
P21554
Residue:
472
  
Inhibitor
Name:
BDBM163068
Synonyms:
US9062004, 35 | US9670216, 35 2-Propyl-5-(3,3,5,5-tetramethylcyclohexyl)pyrazolo[3,4-d]pyridazin-4-one
Type:
Small organic molecule
Emp. Form.:
C18H28N4O
Mol. Mass.:
316.4411
SMILES:
CCCn1cc2c(cnn(C3CC(C)(C)CC(C)(C)C3)c2=O)n1
: