Target
Cannabinoid receptor 1
Ligand
BDBM163070
Substrate
Meas. Tech.
Radioligand Binding Assay
Temperature
298.15±n/a K
IC50
>10000±n/a nM
Comments
extracted
Citation
 Chen, JPettit, SFliri, H Cannabinoid-2 agonists US Patent  US9670216 Publication Date 6/6/2017 
Target
Name:
Cannabinoid receptor 1
Synonyms:
CANN6 CB-R CNR CNR1_HUMAN Cannabinoid receptor Cannabinoid receptor 1 (brain)
Type:
G Protein-Coupled Receptor (GPCR)
Mol. Mass.:
52868.96
Organism:
Homo sapiens (Human)
Description:
P21554
Residue:
472
  
Inhibitor
Name:
BDBM163070
Synonyms:
US9062004, 37 | US9670216, 37 2-(2-Morpholin-4-ylethyl)-5-(3,3,5,5-tetramethylcyclohexyl)pyrazolo[3,4-d]pyridazin-4-one
Type:
Small organic molecule
Emp. Form.:
C21H33N5O2
Mol. Mass.:
387.519
SMILES:
CC1(C)CC(CC(C)(C)C1)n1ncc2nn(CCN3CCOCC3)cc2c1=O
: