Target
Cannabinoid receptor 2
Ligand
BDBM163072
Substrate
Meas. Tech.
Radioligand Binding Assay
Temperature
298.15±n/a K
IC50
2042±n/a nM
Comments
extracted
Citation
 Chen, JPettit, SFliri, H Cannabinoid-2 agonists US Patent  US9670216 Publication Date 6/6/2017 
Target
Name:
Cannabinoid receptor 2
Synonyms:
CANNABINOID CB2 CB2 CB2B CNR2_HUMAN Cannabinoid CB2 receptor Cannabinoid receptor 2 (CB2R) | hCB2
Type:
G Protein-Coupled Receptor (GPCR)
Mol. Mass.:
39690.94
Organism:
Homo sapiens (Human)
Description:
P34972
Residue:
360
  
Inhibitor
Name:
BDBM163072
Synonyms:
US9062004, 39 | US9670216, 39 2-(2-Dimethylaminoethyl)-5-(3,3,5,5-tetramethylcyclohexyl)pyrazolo[3,4-d]pyridazin-4-one
Type:
Small organic molecule
Emp. Form.:
C19H31N5O
Mol. Mass.:
345.4823
SMILES:
CN(C)CCn1cc2c(cnn(C3CC(C)(C)CC(C)(C)C3)c2=O)n1
: