Target
Coagulation factor XI
Ligand
BDBM161051
Substrate
Meas. Tech.
In Vitro Assay
Ki
1737±n/a nM
Citation
 Orwat, MJPinto, DJSmith, II, LMCorte, JRSrivastava, S Substituted 4,5,6,7-tetrahydropyrazolo[4,3-c]pyridines as factor XIa inhibitors US Patent  US9725435 Publication Date 8/8/2017 
Target
Name:
Coagulation factor XI
Synonyms:
Coagulation factor XIa Coagulation factor XIa light chain FA11_HUMAN Factor XIa PTA | Plasma thromboplastin antecedent
Type:
Enzyme
Mol. Mass.:
70130.58
Organism:
Homo sapiens (Human)
Description:
P03951
Residue:
625
  
Inhibitor
Name:
BDBM161051
Synonyms:
US9108951, 1 US9725435, 1
Type:
Small organic molecule
Emp. Form.:
C27H21ClN6O4
Mol. Mass.:
528.946
SMILES:
OC(=O)c1ccc(NC(=O)[C@@H]2Cc3ccccc3CN2C(=O)\C=C\c2cc(Cl)ccc2-n2cnnn2)cc1
: