Target
Steroid 17-alpha-hydroxylase/17,20 lyase
Ligand
BDBM330390
Substrate
Meas. Tech.
Cyp17 Assay
IC50
0.017±n/a nM
Citation
 Blass, BEAbou-Gharbia, MAChilders, WEIyer, PBoruwa, J Cytochrome P450 inhibitors and their method of use US Patent  US9725436 Publication Date 8/8/2017 
Target
Name:
Steroid 17-alpha-hydroxylase/17,20 lyase
Synonyms:
CP17A_BOVIN CYP17A1 Cytochrome P450-C17 (CYP17A1)
Type:
Protein
Mol. Mass.:
57256.42
Organism:
Bos taurus (Bovine)
Description:
P05185
Residue:
509
  
Inhibitor
Name:
BDBM330390
Synonyms:
US9725436, Entry 9
Type:
Small organic molecule
Emp. Form.:
C24H24ClN5
Mol. Mass.:
417.934
SMILES:
NC(=N)N1CCN(CC1)c1ccc(\C=C\c2cc(Cl)cc(c2)-c2ccncc2)cc1
: