Target
Cholesterol side-chain cleavage enzyme, mitochondrial
Ligand
BDBM330390
Substrate
Meas. Tech.
Cyp11 Assay
IC50
10000±n/a nM
Citation
 Blass, BEAbou-Gharbia, MAChilders, WEIyer, PBoruwa, J Cytochrome P450 inhibitors and their method of use US Patent  US9725436 Publication Date 8/8/2017 
Target
Name:
Cholesterol side-chain cleavage enzyme, mitochondrial
Synonyms:
CP11A_BOVIN CYPXIA1 Cholesterol side-chain cleavage enzyme, mitochondrial Cytochrome P450 11A1 (CYP11A1) | P450(scc)
Type:
Protein
Mol. Mass.:
60346.75
Organism:
Bos taurus (Bovine)
Description:
P00189
Residue:
520
  
Inhibitor
Name:
BDBM330390
Synonyms:
US9725436, Entry 9
Type:
Small organic molecule
Emp. Form.:
C24H24ClN5
Mol. Mass.:
417.934
SMILES:
NC(=N)N1CCN(CC1)c1ccc(\C=C\c2cc(Cl)cc(c2)-c2ccncc2)cc1
: