Target
Steroid 17-alpha-hydroxylase/17,20 lyase
Ligand
BDBM330394
Substrate
Meas. Tech.
Cyp21 Assay
IC50
10000±n/a nM
Citation
 Blass, BEAbou-Gharbia, MAChilders, WEIyer, PBoruwa, J Cytochrome P450 inhibitors and their method of use US Patent  US9725436 Publication Date 8/8/2017 
Target
Name:
Steroid 17-alpha-hydroxylase/17,20 lyase
Synonyms:
CP17A_BOVIN CYP17A1 Cytochrome P450-C17 (CYP17A1)
Type:
Protein
Mol. Mass.:
57256.42
Organism:
Bos taurus (Bovine)
Description:
P05185
Residue:
509
  
Inhibitor
Name:
BDBM330394
Synonyms:
US9725436, Entry 13
Type:
Small organic molecule
Emp. Form.:
C23H25FN6
Mol. Mass.:
404.4832
SMILES:
NC(=N)N1CCN(CC1)c1ccc(\C=C\c2cc(F)cc(Cn3ccnc3)c2)cc1
: