Target
Steroid 17-alpha-hydroxylase/17,20 lyase
Ligand
BDBM330395
Substrate
Meas. Tech.
Cyp21 Assay
IC50
10000±n/a nM
Citation
 Blass, BEAbou-Gharbia, MAChilders, WEIyer, PBoruwa, J Cytochrome P450 inhibitors and their method of use US Patent  US9725436 Publication Date 8/8/2017 
Target
Name:
Steroid 17-alpha-hydroxylase/17,20 lyase
Synonyms:
CP17A_BOVIN CYP17A1 Cytochrome P450-C17 (CYP17A1)
Type:
Protein
Mol. Mass.:
57256.42
Organism:
Bos taurus (Bovine)
Description:
P05185
Residue:
509
  
Inhibitor
Name:
BDBM330395
Synonyms:
US9725436, Entry 14
Type:
Small organic molecule
Emp. Form.:
C25H26FN5O
Mol. Mass.:
431.5052
SMILES:
Fc1cc(Cn2ccnc2)cc(\C=C\c2ccc(cc2)N2CCN(CC2)C2=NCCO2)c1
: