Target
Epidermal growth factor receptor [T790M,L858R]
Ligand
BDBM330401
Substrate
Meas. Tech.
Vitro Enzymology Assay
IC50
0.600±n/a nM
Citation
 Xiao, DZhu, YHu, YWang, HLi, JPeng, YZhang, HLuo, HKong, FHan, Y Quinazoline derivative and preparation method therefor US Patent  US9725439 Publication Date 8/8/2017 
Target
Name:
Epidermal growth factor receptor [T790M,L858R]
Synonyms:
EGFR EGFR_HUMAN ERBB1 Epidermal growth factor receptor (EGFR)(T790M/L858R) Epidermal growth factor receptor (T790M, L858R) Epidermal growth factor receptor(L858R, T790M) | HER1
Type:
Mol. Mass.:
134353.72
Organism:
Homo sapiens (Human)
Description:
P00533[T790M,L858R]
Residue:
1210
  
Inhibitor
Name:
BDBM330401
Synonyms:
(S)—N6-(1-acryloylazetidin-3-yl)-N4-(3-chloro-4-fluorophenyl)-7-(tetrahydrofuran-3-yloxy)quinazoline-4,6-diamine | US9725439, 3
Type:
Small organic molecule
Emp. Form.:
C24H23ClFN5O3
Mol. Mass.:
483.923
SMILES:
Fc1ccc(Nc2ncnc3cc(O[C@H]4CCOC4)c(NC4CN(C4)C(=O)C=C)cc23)cc1Cl
: