Target
Prolyl endopeptidase FAP
Ligand
BDBM12176
Substrate
BDBM11526
Meas. Tech.
Enzyme Inhibition Assay
IC50
>20000±n/a nM
Citation
 Tsai, TYCoumar, MSHsu, THsieh, HPChien, CHChen, CTChang, CNLo, YKWu, SHHuang, CYHuang, YWWang, MHWu, HYLee, HJChen, XChao, YSJiaang, WT Substituted pyrrolidine-2,4-dicarboxylic acid amides as potent dipeptidyl peptidase IV inhibitors. Bioorg Med Chem Lett 16:3268-72 (2006)  
Target
Name:
Prolyl endopeptidase FAP
Synonyms:
170 kDa melanoma membrane-bound gelatinase Fibroblast Activation Protein (FAP) Integral membrane serine protease Seprase
Type:
Enzyme
Mol. Mass.:
87712.48
Organism:
Homo sapiens (Human)
Description:
Q12884
Residue:
760
  
Inhibitor
Name:
BDBM12176
Synonyms:
2-{[(3S,5S)-5-{[(3R)-3-fluoropyrrolidin-1-yl]carbonyl}pyrrolidin-3-yl]carbonyl}-2,3-dihydro-1H-isoindole | pyrrolidine-2,4-dicarboxylic acid amide 8l
Type:
Small organic molecule
Emp. Form.:
C18H22FN3O2
Mol. Mass.:
331.3846
SMILES:
F[C@@H]1CCN(C1)C(=O)[C@@H]1C[C@@H](CN1)C(=O)N1Cc2ccccc2C1
:
Substrate
Name:
BDBM11526
Synonyms:
1-(2-aminoacetyl)-N-(4-nitrophenyl)pyrrolidine-2-carboxamide Gly-Pro-pNA
Type:
Small organic molecule
Emp. Form.:
C13H16N4O4
Mol. Mass.:
292.2905
SMILES:
NCC(=O)N1CCCC1C(=O)Nc1ccc(cc1)[N+]([O-])=O
: