Target
Dipeptidyl peptidase 2
Ligand
BDBM12195
Substrate
BDBM12196
Meas. Tech.
Enzyme Inhibition Assay
IC50
38377±n/a nM
Citation
 Jiaang, WTChen, YSHsu, TWu, SHChien, CHChang, CNChang, SPLee, SJChen, X Novel isoindoline compounds for potent and selective inhibition of prolyl dipeptidase DPP8. Bioorg Med Chem Lett 15:687-91 (2005)  
Target
Name:
Dipeptidyl peptidase 2
Synonyms:
DAP II DPP2_HUMAN Dipeptidyl aminopeptidase II Dipeptidyl peptidase 2 (DPP2) Dipeptidyl peptidase II (DPP II) Dipeptidyl peptidase II and dipeptidyl peptidase IV (DPP2 and DPP4) carboxytripeptidase dipeptidyl(amino)peptidase II | dipeptidylarylamidase
Type:
Protein
Mol. Mass.:
54339.29
Organism:
Homo sapiens (Human)
Description:
Q9UHL4
Residue:
492
  
Inhibitor
Name:
BDBM12195
Synonyms:
2-amino-4-{4-[bis(4-fluorophenyl)methyl]piperazin-1-yl}-1-(2,3-dihydro-1H-isoindol-2-yl)butane-1,4-dione | isoquinoline derivative 18
Type:
Small organic molecule
Emp. Form.:
C29H30F2N4O2
Mol. Mass.:
504.5709
SMILES:
NC(CC(=O)N1CCN(CC1)C(c1ccc(F)cc1)c1ccc(F)cc1)C(=O)N1Cc2ccccc2C1
:
Substrate
Name:
BDBM12196
Synonyms:
2,6-diamino-N-{1-[(4-nitrophenyl)carbamoyl]ethyl}hexanamide Lys-Ala-pNA
Type:
Emp. Form.:
Mol. Mass.:
SMILES:
: