Target
Tyrosine-protein kinase JAK1
Ligand
BDBM330945
Substrate
Meas. Tech.
Biochemical HTRF Assay Protocol
IC50
77.0±n/a nM
Citation
 Childers, MLDinsmore, CFuller, PGuerin, DKatz, JDPu, QScott, METhompson, CFZhang, HFalcone, DTorres, LBrubaker, JZeng, HCai, JDu, XWang, CBai, YKong, NLiu, YZheng, Z Cycloalkyl nitrile pyrazolo pyridones as Janus kinase inhibitors US Patent  US9725445 Publication Date 8/8/2017 
Target
Name:
Tyrosine-protein kinase JAK1
Synonyms:
JAK-1 JAK1A JAK1_HUMAN Janus kinase 1 (JAK1) | Janus kinase 1 JAK1
Type:
Protein
Mol. Mass.:
133293.73
Organism:
Homo sapiens (Human)
Description:
P23458
Residue:
1154
  
Inhibitor
Name:
BDBM330945
Synonyms:
US9725445, 3-126 | US9725445, 3-127
Type:
Small organic molecule
Emp. Form.:
C22H24N6O3S
Mol. Mass.:
452.529
SMILES:
CC1N(C)S(=O)(=O)c2ccc(Nc3nn([C@H]4CCCC[C@@H]4C#N)c4cc[nH]c(=O)c34)cc12
: