Target
Cathepsin S
Ligand
BDBM331614
Substrate
Meas. Tech.
Enzyme Assay
Ki
56.0±n/a nM
Citation
 Nardi, ARatcliffe, PCraan, THertrampf, TLesch, BKime, RSteinhagen, H 3-oxo-tetrahydro-furo[3,2-B]pyrrol-4(5H)-yl) derivatives I US Patent  US9725459 Publication Date 8/8/2017 
Target
Name:
Cathepsin S
Synonyms:
CATS_HUMAN Cathepsin S (Cat S) | cathepsin S preproprotein
Type:
Protein
Mol. Mass.:
37507.38
Organism:
Homo sapiens (Human)
Description:
P25774
Residue:
331
  
Inhibitor
Name:
BDBM331614
Synonyms:
3-(5-(((S)-2-((3aS,6S,6aS)-6-chloro-3- oxotetrahydro-2H-furo[3,2-b]pyrrol-4(5H)-yl)- 1-cyclohexyl-2- oxoethyl)carbamoyl)thiophen-2-yl)pyridazine 1-oxide | US9725459, 79
Type:
Small organic molecule
Emp. Form.:
C23H25ClN4O5S
Mol. Mass.:
504.986
SMILES:
[O-][n+]1cccc(n1)-c1ccc(s1)C(=O)N[C@@H](C1CCCCC1)C(=O)N1C[C@H](Cl)[C@H]2OCC(=O)[C@@H]12
: