Target
Metabotropic glutamate receptor 5
Ligand
BDBM197346
Substrate
Metabotropic glutamate receptor 5 (mGlu5)
Meas. Tech.
mGlu3 Ca2+ Flux Assay
Temperature
298.15±n/a K
IC50
30000±240 nM
Comments
extracted
Citation
 Conn, PJLindsley, CWEmmitte, KAEngers, JLKonkol, LC Substituted pyrazolo[1,5-a]pyrazines as negative allosteric modulators of metabotropic glutamate receptor 3 US Patent  US9676782 Publication Date 6/13/2017 
Target
Name:
Metabotropic glutamate receptor 5
Synonyms:
GRM5_RAT Grm5 Mglur5 metabotropic glutamate 5/1-C metabotropic glutamate 5a
Type:
Enzyme
Mol. Mass.:
131900.14
Organism:
Rattus norvegicus (Rat)
Description:
P31424
Residue:
1203
  
Inhibitor
Name:
BDBM197346
Synonyms:
5-(2-fluorophenyl)-2-(((4-methoxyphenyl)(methyl)amino)methyl)-6,7-dihydropyrazolo[1,5-a]pyrazin-4(5h)-one | US9676782, 105
Type:
Small organic molecule
Emp. Form.:
C21H21FN4O2
Mol. Mass.:
380.4154
SMILES:
COc1ccc(cc1)N(C)Cc1cc2C(=O)N(CCn2n1)c1ccccc1F
:
Substrate
Name:
Metabotropic glutamate receptor 5
Synonyms:
GRM5_RAT Grm5 Mglur5 metabotropic glutamate 5/1-C metabotropic glutamate 5a
Type:
Enzyme
Mol. Mass.:
131900.14
Organism:
Rattus norvegicus (Rat)
Description:
P31424
Residue:
1203