Target
G-protein coupled receptor 183
Ligand
BDBM332574
Substrate
Meas. Tech.
Cell-Based Luminescent Assay
IC50
<5±n/a nM
Citation
 Pinkerton, ABArdecky, RSergienko, EAGonzalez-Lopez, MGanji, SRZou, J Spirocyclic EBI2 modulators US Patent  US10196369 Publication Date 2/5/2019 
Target
Name:
G-protein coupled receptor 183
Synonyms:
EBI2 GPR183
Type:
PROTEIN
Mol. Mass.:
41245.79
Organism:
Homo sapiens (Human)
Description:
ChEMBL_108311
Residue:
361
  
Inhibitor
Name:
BDBM332574
Synonyms:
(2E)-3-(3,4-dichlorophenyl)-1-{7-[(4-chlorophenyl)carbonyl]-2,7-diazaspiro[3.5]non-2-yl}prop-2-en-1-one | US10196369, Compound C29
Type:
Small organic molecule
Emp. Form.:
C23H21Cl3N2O2
Mol. Mass.:
463.784
SMILES:
Clc1ccc(cc1)C(=O)N1CCC2(CN(C2)C(=O)\C=C\c2ccc(Cl)c(Cl)c2)CC1
: