Target
G-protein coupled receptor 183
Ligand
BDBM332597
Substrate
Meas. Tech.
Cell-Based Luminescent Assay
IC50
<5±n/a nM
Citation
 Pinkerton, ABArdecky, RSergienko, EAGonzalez-Lopez, MGanji, SRZou, J Spirocyclic EBI2 modulators US Patent  US10196369 Publication Date 2/5/2019 
Target
Name:
G-protein coupled receptor 183
Synonyms:
EBI2 GPR183
Type:
PROTEIN
Mol. Mass.:
41245.79
Organism:
Homo sapiens (Human)
Description:
ChEMBL_108311
Residue:
361
  
Inhibitor
Name:
BDBM332597
Synonyms:
(2E)-3-(4-bromophenyl)-1-(2-{[4-fluoro-2-(trifluoromethyl)phenyl]carbonyl}-2,7-diazaspiro[3.5]non-7-yl)prop-2-en-1-one | US10196369, Compound C52
Type:
Small organic molecule
Emp. Form.:
C24H21BrF4N2O2
Mol. Mass.:
525.333
SMILES:
Fc1ccc(C(=O)N2CC3(C2)CCN(CC3)C(=O)\C=C\c2ccc(Br)cc2)c(c1)C(F)(F)F
: