Target
G-protein coupled receptor 183
Ligand
BDBM332598
Substrate
Meas. Tech.
Cell-Based Luminescent Assay
IC50
<5±n/a nM
Citation
 Pinkerton, ABArdecky, RSergienko, EAGonzalez-Lopez, MGanji, SRZou, J Spirocyclic EBI2 modulators US Patent  US10196369 Publication Date 2/5/2019 
Target
Name:
G-protein coupled receptor 183
Synonyms:
EBI2 GPR183
Type:
PROTEIN
Mol. Mass.:
41245.79
Organism:
Homo sapiens (Human)
Description:
ChEMBL_108311
Residue:
361
  
Inhibitor
Name:
BDBM332598
Synonyms:
(2E)-3-(4-bromophenyl)-1-{2-[(4-fluorophenyl)carbonyl]-2,7-diazaspiro[3.5]non-7-yl}prop-2-en-1-one | US10196369, Compound C53
Type:
Small organic molecule
Emp. Form.:
C23H22BrFN2O2
Mol. Mass.:
457.335
SMILES:
Fc1ccc(cc1)C(=O)N1CC2(C1)CCN(CC2)C(=O)\C=C\c1ccc(Br)cc1
: