Target
G-protein coupled receptor 183
Ligand
BDBM332623
Substrate
Meas. Tech.
Cell-Based Luminescent Assay
IC50
<5±n/a nM
Citation
 Pinkerton, ABArdecky, RSergienko, EAGonzalez-Lopez, MGanji, SRZou, J Spirocyclic EBI2 modulators US Patent  US10196369 Publication Date 2/5/2019 
Target
Name:
G-protein coupled receptor 183
Synonyms:
EBI2 GPR183
Type:
PROTEIN
Mol. Mass.:
41245.79
Organism:
Homo sapiens (Human)
Description:
ChEMBL_108311
Residue:
361
  
Inhibitor
Name:
BDBM332623
Synonyms:
3-(4-chlorophenyl)-1-(2-{[4-(trifluoromethyl)phenyl]methyl}-2,7-diazaspiro[3.5]non-7-yl)prop-2-yn-1-one | US10196369, Compound C78
Type:
Small organic molecule
Emp. Form.:
C24H22ClF3N2O
Mol. Mass.:
446.892
SMILES:
FC(F)(F)c1ccc(CN2CC3(C2)CCN(CC3)C(=O)C#Cc2ccc(Cl)cc2)cc1
: