Target
Fibroblast growth factor receptor 1
Ligand
BDBM333184
Substrate
Meas. Tech.
FGFR-1 wild type assay
IC50
550±n/a nM
Citation
 Miduturu, CV Inhibitors of the fibroblast growth factor receptor US Patent  US10196436 Publication Date 2/5/2019 
Target
Name:
Fibroblast growth factor receptor 1
Synonyms:
BFGFR Basic fibroblast growth factor receptor 1 (FGFR1) CEK FGFR-1 FGFR-1, (FL) FGFR1_HUMAN FLT2 Fibroblast growth factor receptor 1 (FGFR-1) Fms-like tyrosine kinase 2 N-sam bFGF-R | c-fgr
Type:
Receptor
Mol. Mass.:
91861.70
Organism:
Homo sapiens (Human)
Description:
P11362
Residue:
822
  
Inhibitor
Name:
BDBM333184
Synonyms:
US10196436, Compound 34
Type:
Small organic molecule
Emp. Form.:
C26H21Cl2FN4O3
Mol. Mass.:
527.374
SMILES:
COc1cc(OC)c(Cl)c(c1Cl)-c1cc(F)c2nc(Nc3c(C)cccc3NC(=O)C=C)ncc2c1
: