Target
Coagulation factor X
Ligand
BDBM12868
Substrate
BDBM12658
Meas. Tech.
Enzyme Assay and Determination of the Inhibition Constants.
pH
7±n/a
Temperature
295.15±n/a K
Ki
0.21±n/a nM
Citation
 Li, YLFevig, JMCacciola, JBuriak, JRossi, KAJona, JKnabb, RMLuettgen, JMWong, PCBai, SAWexler, RRLam, PY Preparation of 1-(3-aminobenzo[d]isoxazol-5-yl)-1H-pyrazolo[4,3-d]pyrimidin-7(6H)-ones as potent, selective, and efficacious inhibitors of coagulation factor Xa. Bioorg Med Chem Lett 16:5176-82 (2006)  
Target
Name:
Coagulation factor X
Synonyms:
Activated coagulation factor X (FXa) Coagulation factor X precursor F10 Factor X heavy chain Factor Xa Stuart-Prower factor
Type:
Enzyme
Mol. Mass.:
54726.60
Organism:
Homo sapiens (Human)
Description:
Residue:
488
  
Inhibitor
Name:
BDBM12868
Synonyms:
1-(3-amino-1,2-benzoxazol-5-yl)-6-[4-(2-{[(3R)-3-hydroxypyrrolidin-1-yl]methyl}phenyl)phenyl]-3-(trifluoromethyl)-1H,4H,5H,6H,7H-pyrazolo[4,3-d]pyrimidin-7-one | dihydropyrazolo[4,3-d]pyrimidinone 24b
Type:
Small organic molecule
Emp. Form.:
C30H26F3N7O3
Mol. Mass.:
589.5677
SMILES:
Nc1noc2ccc(cc12)-n1nc(c2NCN(C(=O)c12)c1ccc(cc1)-c1ccccc1CN1CC[C@@H](O)C1)C(F)(F)F
:
Substrate
Name:
BDBM12658
Synonyms:
4-[({[(1S)-4-carbamimidamido-1-[(4-nitrophenyl)carbamoyl]butyl]carbamoyl}methyl)carbamoyl]-4-[(2S,3S)-3-methyl-2-(phenylformamido)pentanamido]butanoic acid hydrochloride Chromogenic Substrate S-2222 benzoyl-Ile-Glu-Gly-Arg-p-nitroanilide
Type:
Small organic molecule
Emp. Form.:
C32H43N9O9
Mol. Mass.:
697.7387
SMILES:
[#6]-[#6]-[#6@H](-[#6])-[#6@H](-[#7]-[#6](=O)-c1ccccc1)-[#6](=O)-[#7]-[#6@@H](-[#6]-[#6]-[#6](-[#8])=O)-[#6](=O)-[#7]-[#6]-[#6](=O)-[#7]-[#6@@H](-[#6]-[#6]-[#6]\[#7]=[#6](\[#7])-[#7])-[#6](=O)-[#7]-c1ccc(cc1)-[#7+](-[#8-])=O
: