Target
RAF proto-oncogene serine/threonine-protein kinase
Ligand
BDBM333571
Substrate
Meas. Tech.
Competition Binding Assay
Kd
<250±n/a nM
Citation
 Abraham, SBhagwat, SSCampbell, BTChao, QFaraoni, RHolladay, MWLai, AGRowbottom, MWSetti, ESprankle, KG RAF kinase modulator compounds and methods of use thereof US Patent  US9730937 Publication Date 8/15/2017 
Target
Name:
RAF proto-oncogene serine/threonine-protein kinase
Synonyms:
C-Raf Protein Kinase RAF RAF1 Raf-1 Serine/threonine-protein kinase C-Raf | cRaf
Type:
Serine/threonine-protein kinase
Mol. Mass.:
73082.52
Organism:
Homo sapiens (Human)
Description:
P04049
Residue:
648
  
Inhibitor
Name:
BDBM333571
Synonyms:
1-(3-tert- butylphenyl)- 3-(3-(6,7- dimethoxy- quinazolin- 4- yloxy)phenyl) urea | US9730937, Example 118
Type:
Small organic molecule
Emp. Form.:
C27H28N4O4
Mol. Mass.:
472.5356
SMILES:
COc1cc2ncnc(Oc3cccc(NC(=O)Nc4cccc(c4)C(C)(C)C)c3)c2cc1OC
: