Target
RAF proto-oncogene serine/threonine-protein kinase
Ligand
BDBM333590
Substrate
Meas. Tech.
Competition Binding Assay
Kd
<250±n/a nM
Citation
 Abraham, SBhagwat, SSCampbell, BTChao, QFaraoni, RHolladay, MWLai, AGRowbottom, MWSetti, ESprankle, KG RAF kinase modulator compounds and methods of use thereof US Patent  US9730937 Publication Date 8/15/2017 
Target
Name:
RAF proto-oncogene serine/threonine-protein kinase
Synonyms:
C-Raf Protein Kinase RAF RAF1 Raf-1 Serine/threonine-protein kinase C-Raf | cRaf
Type:
Serine/threonine-protein kinase
Mol. Mass.:
73082.52
Organism:
Homo sapiens (Human)
Description:
P04049
Residue:
648
  
Inhibitor
Name:
BDBM333590
Synonyms:
1-(3-(6,7- dimethoxy- quinazolin- 4- yloxy)phenyl)- 3-(4- methoxy-3- (trifluoromethyl) phenyl)urea | US9730937, Example 138
Type:
Small organic molecule
Emp. Form.:
C25H21F3N4O5
Mol. Mass.:
514.4532
SMILES:
COc1ccc(NC(=O)Nc2cccc(Oc3ncnc4cc(OC)c(OC)cc34)c2)cc1C(F)(F)F
: