Target
RAF proto-oncogene serine/threonine-protein kinase
Ligand
BDBM333616
Substrate
Meas. Tech.
Competition Binding Assay
Kd
<250±n/a nM
Citation
 Abraham, SBhagwat, SSCampbell, BTChao, QFaraoni, RHolladay, MWLai, AGRowbottom, MWSetti, ESprankle, KG RAF kinase modulator compounds and methods of use thereof US Patent  US9730937 Publication Date 8/15/2017 
Target
Name:
RAF proto-oncogene serine/threonine-protein kinase
Synonyms:
C-Raf Protein Kinase RAF RAF1 Raf-1 Serine/threonine-protein kinase C-Raf | cRaf
Type:
Serine/threonine-protein kinase
Mol. Mass.:
73082.52
Organism:
Homo sapiens (Human)
Description:
P04049
Residue:
648
  
Inhibitor
Name:
BDBM333616
Synonyms:
1-[3-(6,7- dimethoxy- quinazolin- 4- yloxy) phenyl]-3-[1- methyl-5- (trifluoromethyl)- 1H- pyrazol-3- yl]urea | US9730937, Example 165
Type:
Small organic molecule
Emp. Form.:
C22H19F3N6O4
Mol. Mass.:
488.4193
SMILES:
COc1cc2ncnc(Oc3cccc(NC(=O)Nc4cc(n(C)n4)C(F)(F)F)c3)c2cc1OC
: