Target
RAF proto-oncogene serine/threonine-protein kinase
Ligand
BDBM333637
Substrate
Meas. Tech.
Competition Binding Assay
Kd
>1000±n/a nM
Citation
 Abraham, SBhagwat, SSCampbell, BTChao, QFaraoni, RHolladay, MWLai, AGRowbottom, MWSetti, ESprankle, KG RAF kinase modulator compounds and methods of use thereof US Patent  US9730937 Publication Date 8/15/2017 
Target
Name:
RAF proto-oncogene serine/threonine-protein kinase
Synonyms:
C-Raf Protein Kinase RAF RAF1 Raf-1 Serine/threonine-protein kinase C-Raf | cRaf
Type:
Serine/threonine-protein kinase
Mol. Mass.:
73082.52
Organism:
Homo sapiens (Human)
Description:
P04049
Residue:
648
  
Inhibitor
Name:
BDBM333637
Synonyms:
1-(4-chloro- 3- (trifluoromethyl) phenyl)- 3-(3-(6,7- dimethoxy- quinazolin- 4- ylthio)phenyl) urea | US9730937, Example 186
Type:
Small organic molecule
Emp. Form.:
C24H18ClF3N4O3S
Mol. Mass.:
534.938
SMILES:
COc1cc2ncnc(Sc3cccc(NC(=O)Nc4ccc(Cl)c(c4)C(F)(F)F)c3)c2cc1OC
: