Target
Serine/threonine-protein kinase B-raf [V600E]
Ligand
BDBM333639
Substrate
Meas. Tech.
Competition Binding Assay
Kd
375±n/a nM
Citation
 Abraham, SBhagwat, SSCampbell, BTChao, QFaraoni, RHolladay, MWLai, AGRowbottom, MWSetti, ESprankle, KG RAF kinase modulator compounds and methods of use thereof US Patent  US9730937 Publication Date 8/15/2017 
Target
Name:
Serine/threonine-protein kinase B-raf [V600E]
Synonyms:
B-RAF V600E B-Raf Protein Kinase Mutant (V600E) BRAF BRAF mutant V600E BRAF_HUMAN Protein mono-ADP-ribosyltransferase (PARP3) RAFB1 Serine/threonine-protein kinase B-raf (V600E) V-RAF murine sarcoma viral oncogene homologue B1 mutant (BRAF V600E)
Type:
Mol. Mass.:
84474.98
Organism:
Homo sapiens (Human)
Description:
P15056 V600E
Residue:
766
  
Inhibitor
Name:
BDBM333639
Synonyms:
1-(3-(6,7- dimethoxy- quinazolin- 4- ylthio)phenyl)- 3-(3- fluoro-4- (trifluoromethyl) phenyl) urea | US9730937, Example 188
Type:
Small organic molecule
Emp. Form.:
C24H18F4N4O3S
Mol. Mass.:
518.483
SMILES:
COc1cc2ncnc(Sc3cccc(NC(=O)Nc4ccc(c(F)c4)C(F)(F)F)c3)c2cc1OC
: