Target
Serine/threonine-protein kinase B-raf [V600E]
Ligand
BDBM333643
Substrate
Meas. Tech.
Competition Binding Assay
Kd
750±n/a nM
Citation
 Abraham, SBhagwat, SSCampbell, BTChao, QFaraoni, RHolladay, MWLai, AGRowbottom, MWSetti, ESprankle, KG RAF kinase modulator compounds and methods of use thereof US Patent  US9730937 Publication Date 8/15/2017 
Target
Name:
Serine/threonine-protein kinase B-raf [V600E]
Synonyms:
B-RAF V600E B-Raf Protein Kinase Mutant (V600E) BRAF BRAF mutant V600E BRAF_HUMAN Protein mono-ADP-ribosyltransferase (PARP3) RAFB1 Serine/threonine-protein kinase B-raf (V600E) V-RAF murine sarcoma viral oncogene homologue B1 mutant (BRAF V600E)
Type:
Mol. Mass.:
84474.98
Organism:
Homo sapiens (Human)
Description:
P15056 V600E
Residue:
766
  
Inhibitor
Name:
BDBM333643
Synonyms:
1-[3-(6,7- dimethoxy- quinazolin- 4- ylthio)phenyl]- 3-[1- phenyl-3- (trifluoromethyl)- 1H- pyrazol-5-yl] urea US9730937, Example 339
Type:
Small organic molecule
Emp. Form.:
C27H21F3N6O3S
Mol. Mass.:
566.554
SMILES:
COc1cc2ncnc(Sc3cccc(NC(=O)Nc4cc(nn4-c4ccccc4)C(F)(F)F)c3)c2cc1OC
: